{"text_format":"1","workbook":"xlsx","n_sheets":5,"sheets":["Serviceability Calculator","Lender Comparison","LVR Calculator"," Income lookup tables","Income Tax Rates"],"not_rendered":{"charts":1,"images":2,"macros":1,"external_links":2,"defined_names":17,"comments":1,"pivot_tables":0},"unopened":[],"bounds":{"document_bytes":16777216,"sheet_cells":100000,"rows_first":2000,"rows_last":500,"rows_between":2000,"halvings":0,"cell_chars":16384,"cell_head_chars":4096},"cells_cut":0,"cells_raw":0,"read":"whole","date_system":"1900"}

{"sheet":"Serviceability Calculator","index":0,"n_rows":89,"n_cols":24,"rows_kept":89,"cut":false,"hidden":false,"merged":[[9,8,9,9],[17,8,17,9],[64,8,65,8],[0,0,3,10],[4,0,4,10],[7,0,7,10],[15,8,15,9],[33,8,33,10],[26,4,27,5],[25,0,25,10],[20,0,20,10],[5,8,5,10],[6,8,6,9],[17,2,17,5],[9,2,9,3],[11,6,11,7],[11,8,11,9],[15,2,15,5],[43,14,44,14],[10,12,20,16],[44,16,45,19],[11,2,11,3],[67,7,67,9],[32,0,32,10],[50,12,51,12],[43,12,44,12],[43,13,44,13],[50,13,51,13],[40,0,40,10],[35,11,37,16],[52,16,52,18],[44,3,44,4],[42,3,42,4],[61,0,61,10],[47,16,49,19]]}
[]
[]
[]
[]
[]
[null,null,null,null,null,null,null,null,"\nVERSION-2025-Q2 HEM\n"]
["INDICATIVE LOAN SERVICEABILITY CALCULATOR ",null,null,null,null,null,null,"Issue Date:","2025-11-03"]
["Loan Details"]
[]
[null,"Applicant 1 Name ","John",null,"Age",23,null,"LOAN ID",null,null,null,null,"Disclaimer"]
[null,null,null,null,null,null,null,null,null,null,null,null,"Wisr has provided this Indicative Loan Serviceability Calculator to provide the user with an indication of a single or joint  loan  applicants capacity to meet their financial commitments.  This calculation is entirely indicative in nature and does not bind Wisr in any way.  Provision of this tool and and the calculation does not remove the obligation of a broker to make a preliminary assessment as required under the NCCP Act."]
[null,"Applicant 2 Name ",null,null,"Age",null,"Estimated Interest Rate",null,0.13539999999999999]
[]
[]
[]
[null,"Application Date",{"$f":"TODAY()","v":"2025-10-27"},null,null,null,null,"Total Liabilities"]
[]
[null,"Loan Term (Months)",84,null,null,null,null,"Total  Assets"]
[]
[]
["Applicant(s) Annual Income ",null,null,null,null,null,null,null,null,null,null,null,null,null,null,null,null,null,"State","No of dependents"]
["Applicant Name(s)",null,"Gross Annual Salary Income","Overtime","Commission/Recurring Bonuses","Second Job","Rental Income","Investment Income – Interes","Tax Applicable","Net Cash (Aft.Tax)",null,null,null,null,null,null,null,null,"NSW",0,null,2,null,"Married status Index"]
[{"$f":"\"1) \"&C10","v":"1) John"},null,90000,null,null,null,null,null,{"$f":"VLOOKUP(C23+D23*0.8+E23*0.8+F23+$E$25+H23*0.8,TaxRates,2,TRUE)+VLOOKUP(C23+D23*0.8+E23*0.8+F23+$E$25+H23*0.8,TaxRates,3,TRUE)*(C23+D23*0.8+E23*0.8+F23+$E$25+H23*0.8-VLOOKUP(C23+D23*0.8+E23*0.8+F23+$E$25+H23*0.8,TaxRates,1,TRUE))+SUM(C23+D23*0.8+E23*0.8+F23+$E$25+H23*0.8)*0.02-SUM('Income Tax Rates'!F19:F20)","v":19587.699999999997},{"$f":"IF(SUM(C23+D23*0.8+E23*0.8+F23+$E$25+H23*0.8)=0,0,IF(SUM(C23+D23*0.8+E23*0.8+F23+$E$25+H23*0.8)-I23<0,0,SUM(C23+D23*0.8+E23*0.8+F23+$E$25+H23*0.8)-I23))","v":70412.3},null,null,null,null,null,null,null,null,"VIC",1,null,1,null,"Married"]
[{"$f":"\"2) \"&C12","v":"2) "},null,null,null,null,null,null,null,{"$f":"VLOOKUP(C24+D24*0.8+E24*0.8+F24+H24*0.8,TaxRates,2,TRUE)+VLOOKUP(C24+D24*0.8+E24*0.8+F24+H24*0.8,TaxRates,3,TRUE)*(C24+D24*0.8+E24*0.8+F24+H24*0.8-VLOOKUP(C24+D24*0.8+E24*0.8+F24+H24*0.8,TaxRates,1,TRUE))+SUM(C24+D24*0.8+E24*0.8+F24+H24*0.8)*0.02-SUM('Income Tax Rates'!F42:F43)","v":-700},{"$f":"IF(SUM(C24+D24*0.8+E24*0.8+F24+H24*0.8)=0,0,IF(SUM(C24+D24*0.8+E24*0.8+F24+H24*0.8)-I24<0,0,SUM(C24+D24*0.8+E24*0.8+F24+H24*0.8)-I24))","v":0},null,null,null,null,null,null,null,null,"QLD",2,null,2,null,"Single"]
["Partner's income verified for non-joint app",null,null,75088,{"$f":"IF($O$47=\"yes\",IF((G23)*0.8*$T$56>$L$49,(G23)*0.8*$T$56-$L$49,0),IF((G23)*0.8>$L$49,(G23)*0.8-$L$49,0))","v":0},null,"Net monthly Income after TAX  inc. MEDICARE LEVY",null,null,{"$f":"SUM(J23:J24)/12","v":5867.6916666666666},null,null,null,null,null,null,null,null,"SA",3,null,null,null,"Defacto"]
["Non-taxable Annual Income",null,null,null,null,null,null,null,null,null,null,null,null,null,null,null,null,null,"WA",4]
[null,"Description","Amount",null,"Possible addbacks for self-employed applicant",null,null,null,"Description","Amount",null,null,null,null,null,null,null,null,"TAS",5]
[null,"Family Tax Allowance &Supplements",null,null,null,null,"Amount",null,"Rent assistance",null,null,null,null,null,null,null,null,null,"NT",6]
[null,"Child Support",null,null,"Depreciation",null,null,null,null,null,null,null,null,null,null,null,null,null,"ACT",7]
[null,"VET Affairs Pension",null,null,"Super over contribution",null,null,null,null,null,null,null,null,null,null,null,null,null,null,8]
[null,"Carers Pension",null,null,"Other",null,null,null,null,null,null,null,null,null,null,null,null,null,null,9]
[null,null,null,null,null,null,null,"Net monthly NON TAXABLE INCOME",null,{"$f":"SUM(C28:C31,G29:G31,J28:J31*0.8)/12","v":0},null,null,null,null,null,null,null,null,null,10]
["Household general living expenses "]
[]
[null,"Marital status",null,null,null,"Single",null,null,{"$f":"IF(ISNUMBER($I$36),\"\",\"Please check the State&post code\")","v":""}]
[null,"Number of Dependants",null,null,null,2,null,null,{"$f":"IF((((INDEX(INDIRECT(IF(OR(F37=\"ACT\",F37=\"NT\"),\"\",F37)&' Income lookup tables'!Y14),MATCH(VLOOKUP($F$35,' Income lookup tables'!$AA$3:$AB$5,2,0)&$F$36,' Income lookup tables'!$A$13:$A$34&' Income lookup tables'!$B$13:$B$34,0),MATCH(SUM(C23+D23*0.8+E23*0.8+F23+E25+H23*0.8+C24+D24*0.8+E24*0.8+F24+H24*0.8)+D25+$J$32*12,' Income lookup tables'!$C$1:$T$1,1)))*52)/12)*((SUM(C23:H23)+J32*12)/(SUM(C23:H23)+J32*12+D25))>(((INDEX(INDIRECT(IF(OR(F37=\"ACT\",F37=\"NT\"),\"\",F37)&' Income lookup tables'!Y14),MATCH(VLOOKUP('Serviceability Calculator'!$F$35,' Income lookup tables'!$AA$3:$AB$5,2,0)&$F$36,' Income lookup tables'!$A$13:$A$34&' Income lookup tables'!$B$13:$B$34,0),MATCH(SUM(C23+D23*0.8+E23*0.8+F23+E25+H23*0.8+C24+D24*0.8+E24*0.8+F24+H24*0.8)+D25+$J$32*12,' Income lookup tables'!$C$1:$T$1,1)))*52)/12)*0.5,(((INDEX(INDIRECT(IF(OR(F37=\"ACT\",F37=\"NT\"),\"\",F37)&' Income lookup tables'!Y14),MATCH(VLOOKUP('Serviceability Calculator'!$F$35,' Income lookup tables'!$AA$3:$AB$5,2,0)&$F$36,' Income lookup tables'!$A$13:$A$34&' Income lookup tables'!$B$13:$B$34,0),MATCH(SUM(C23+D23*0.8+E23*0.8+F23+E25+H23*0.8+C24+D24*0.8+E24*0.8+F24+H24*0.8)+D25+$J$32*12,' Income lookup tables'!$C$1:$T$1,1)))*52)/12)*((SUM(C23:H23)+J32*12)/(SUM(C23:H23)+J32*12+D25)),(((INDEX(INDIRECT(IF(OR(F37=\"ACT\",F37=\"NT\"),\"\",F37)&' Income lookup tables'!Y14),MATCH(VLOOKUP('Serviceability Calculator'!$F$35,' Income lookup tables'!$AA$3:$AB$5,2,0)&$F$36,' Income lookup tables'!$A$13:$A$34&' Income lookup tables'!$B$13:$B$34,0),MATCH(SUM(C23+D23*0.8+E23*0.8+F23+E25+H23*0.8+C24+D24*0.8+E24*0.8+F24+H24*0.8)+D25+$J$32*12,' Income lookup tables'!$C$1:$T$1,1)))*52)/12)*0.5)","v":2267.8813723589847},null,null,"\"The Total (Yearly) Household General Living Expenses result for married and de-facto applicants applying alone reflects apportioning based on verifiable partner income  to max 50%\" "]
[null,"Application State",null,null,null,"QLD"]
[null,"Application PostCode",null,null,null,4703,null,"Monthly GLE",{"$f":"IF(I36>F40,I36*12,F40*12)/12","v":2267.8813723589847}]
[null,"Living Type",null,null,null,"Buyer",null,null,"Higher amount of HEM or declared GLE"]
[null,"Customer declared total General living expenses p/m",null,null,null,{"$f":"IF(SUM(C23:H23,J32*12)/SUM(C23:H23,J32*12,D25)<0.5,E40/2,E40*SUM(C23:H23,J32*12)/SUM(C23:H23,J32*12,D25))","v":0}]
["Financial Commitments"]
[]
[null,"Wisr Loan Amount",30000,"  Monthly Repayment",null,{"$f":"-PMT(I12/12,C18,F45,0)+IF(C46=\"Secured\",10,0)","v":601.19144937533713},null,"This Loan",null,"Monthly Amount"]
[null,"Application Fee",520,null,null,null,null,"Wisr P/Loan",null,{"$f":"F43","v":601.19144937533713},null,null,"Repayment","Frequency","Shared or not"]
[null,"Broker Fee",2000,"LOAN TOTAL",null,{"$f":"SUM(C43:C45)","v":32520},null,"Other Monthly Commitments :",null,null,null,null,null,null,null,null,"Applicant's actual P+I Mortgage payments (entered in pink cells) are increased by 5% to approx the buffer effect"]
[null,"Loan Product","Unsecured",null,null,null,null,"Mortgage (Owner Occupied)",null,{"$f":"IFERROR(M46*VLOOKUP(N46,$Q$62:$R$64,2,0)*IF(O46=\"Yes\",$T$56,1),0)*1/12","v":500},null,"Mortgage (O/O)",500,"Monthly","NO"]
[null,"Credit card & Personal loan liabilities break down ",null,null,null,null,null,"Net Mortgage liability for invest property",null,{"$f":"ABS(IF($O$47=\"yes\",IF((G23+G24)*0.8*$T$56>$L$49,0,((G23+G24)*0.8*$T$56-$L$49)),IF((G23+G24)*0.8>$L$49,0,(G23+G24)*0.8-$L$49)))/12","v":500},null,"Mortgage (IPL)",500,"Monthly","NO"]
[null,"Personal Loan breakdown","Amount","Balance","Repayment","Pmt Frequency","Consolidated","Boarding/Rent",null,{"$f":"IF(IF($C$12=\"\",IF(OR($F$39={\"Boarder\",\"Employer\"})=TRUE,650,IF($F$39=\"Living With Parents\",IF($F$10<26,400,650),0)),IF(OR($F$39={\"Renter\",\"Buyer\",\"Other\"})=TRUE,0,750))>IFERROR(M48*VLOOKUP(N48,$Q$62:$R$64,2,0)*IF(O48=\"Yes\",$T$56,1),0)/12,IF($C$12=\"\",IF(OR($F$39={\"Boarder\",\"Employer\"})=TRUE,650,IF($F$39=\"Living With Parents\",IF($F$10<26,400,650),0)),IF(OR($F$39={\"Renter\",\"Buyer\",\"Other\"})=TRUE,0,750)),IFERROR(M48*VLOOKUP(N48,$Q$62:$R$64,2,0)*IF(O48=\"Yes\",$T$56,1),0)/12)","v":0},null,"Board/Rent",null,"Monthly","Yes"]
[null,"pl",null,null,903,"Monthly","No","Credit Cards/OD total from the breakdown",null,{"$f":"SUMPRODUCT(C55:C61,--NOT(ISNUMBER(SEARCH(\"close\",G55:G61))))*0.038","v":76},null,{"$f":"IFERROR($M$47*VLOOKUP($N$47,$Q$62:$R$64,2,0)*IF($O$47=\"Yes\",$T$56,1),0)*1","v":6000}]
[null,null,null,null,null,"Monthly","No","Personal Loans total from the breakdown",null,{"$f":"SUMPRODUCT(E49:E53,LOOKUP(F49:F53,$Q$62:$Q$64,$R$62:$R$64),--NOT(ISNUMBER(SEARCH(\"close\",G49:G53))),IF(ISNUMBER(SEARCH(\"shared\",G49:G53)), T56,1))/12","v":903}]
[null,null,null,null,null,"Monthly","Yes to close",null,null,null,null,null,"Repayment","Frequency"]
[null,null,null,null,null,"Fortnightly","No","Any additional Living expenses (per month)"]
[null,null,null,null,null,"Monthly","Yes to close","Private School Fee",null,{"$f":"IFERROR(IFERROR(M53*VLOOKUP(N53,$Q$62:$R$64,2,0),0)*$T$56,0)/12","v":0},null,"Private School Fee",null,"Fortnightly",null,null,"Mortgage / Additional expenses Proportion Calculator based on Income ratio"]
[null,"Credit Card/Overdraft breakdown","Limit","Balance","Repayment","Pmt Frequency","Consolidated","Child Support/Maintenance",null,0,null,"Child Support",null,"Fortnightly",null,null,null,null,"for Mortgage","for Additional Expenses"]
[null,"cc",2000,null,null,null,"No","Private Health Insurance",null,0,null,"Private Health Insurance",null,"Monthly",null,null,null,null,"Weekly Repayment","% of Proportion"]
[null,null,null,null,null,null,"No","Life insurance/Pet Insurance",null,0,null,"Life insurance/Pet Insurance",null,"Monthly",null,null,"Applicant's income",{"$f":"SUM(C23:H23,J32*12)","v":90000},{"$f":"IFERROR($R$47*($R56/(SUM($R$55:$R$59))),\"\")","v":0},{"$f":"IFERROR(R56/(SUM($R$56:$R$57)),0)","v":0.5451637914324482}]
[null,null,null,null,null,null,"No","Other",null,0,null,"Additional Motor Vehicle (2nd car)",null,"Monthly",null,null,"Partner's income",{"$f":"D25","v":75088},{"$f":"IFERROR($R$47*($R57/(SUM($R$55:$R$59))),\"\")","v":0},{"$f":"IFERROR(R57/(SUM($R$56:$R$57)),0)","v":0.45483620856755186}]
[null,null,null,null,null,null,"No",null,null,0,null,"Other",null,"Monthly"]
[null,null,null,null,null,null,"No",null,null,0,null,null,null,"Monthly"]
[null,null,null,null,null,null,"No","TOTAL Monthly COMMITMENTS",null,{"$f":" J46+SUM(J48:J50)+SUM(J53:J59)+J44+J47","v":2580.191449375337}]
{"$rows_left_out":30}
{"sheet":"Lender Comparison","index":1,"n_rows":29,"n_cols":20,"rows_kept":29,"cut":false,"hidden":false,"merged":[]}
[]
[]
[null,"LENDER SCENARIO COMPARISON"]
[null,null,null,"Wisr",null,null,null,null,null,null,"Lender two",null,null,null,null,null,null,"Lender three"]
[null,"Loan details",null,null,null,null,null,null,"Loan details",null,null,null,null,null,null,"Loan details"]
[]
[null,null,"Loan Amount applied for",null,null,35000,null,null,null,"Loan Amount applied for",null,null,{"$f":"F7","v":35000},null,null,null,"Loan Amount applied for",null,null,{"$f":"F7","v":35000}]
[]
[null,null,"Lenders Fee",null,null,575,null,null,null,"Lenders Fee",null,null,575,null,null,null,"Lenders Fee",null,null,575]
[]
[null,null,"Origination Fee",null,null,990,null,null,null,"Origination Fee",null,null,990,null,null,null,"Origination Fee",null,null,990]
[]
[null,null,"Other Upfront lender fees",null,null,0,null,null,null,"Other Upfront lender fees",null,null,0,null,null,null,"Other Upfront lender fees",null,null,0]
[]
[null,null,"Total Amount of Credit",null,null,{"$f":"F7+F9+F11+F13","v":36565},null,null,null,"Total Amount of Credit",null,null,{"$f":"M7+M9+M11+M13","v":36565},null,null,null,"Total Amount of Credit",null,null,{"$f":"T7+T9+T11+T13","v":36565}]
[]
[null,null,"Interest Rate p.a",null,null,0.1,null,null,null,"Interest Rate p.a",null,null,0.11,null,null,null,"Interest Rate p.a",null,null,0.125]
[]
[null,null,"Term in Months",null,null,60,null,null,null,"Term in Months",null,null,60,null,null,null,"Term in Months",null,null,60]
[]
[null,null,"Monthly Account Fee",null,null,0,null,null,null,"Monthly Account Fee",null,null,0,null,null,null,"Monthly Account Fee",null,null,0]
[]
[null,"Results",null,null,null,null,null,null,"Results",null,null,null,null,null,null,"Results"]
[]
[null,null,"Monthly Repayment",null,null,{"$f":"PMT(F17/12,F19,-F15)+F21","v":776.89818986752448},null,null,null,"Monthly Repayment",null,null,{"$f":"PMT(M17/12,M19,-M15)+M21","v":795.01169965120255},null,null,null,"Monthly Repayment",null,null,{"$f":"PMT(T17/12,T19,-T15)+T21","v":822.63711121233018}]
[]
[null,null,"Total Repayment",null,null,{"$f":"F25*F19","v":46613.891392051468},null,null,null,"Total Repayment",null,null,{"$f":"M25*M19","v":47700.701979072153},null,null,null,"Total Repayment",null,null,{"$f":"T25*T19","v":49358.226672739809}]
[]
[null,null,"Total Interest",null,null,{"$f":"F27-F15","v":10048.891392051468},null,null,null,"Total Interest",null,null,{"$f":"M27-M15","v":11135.701979072153},null,null,null,"Total Interest",null,null,{"$f":"T27-T15","v":12793.226672739809}]

{"sheet":"LVR Calculator","index":2,"n_rows":29,"n_cols":9,"rows_kept":29,"cut":false,"hidden":false,"merged":[]}
[]
[]
[]
[null,"LVR Calculator"]
[null,"Please input into shaded cells",null,"Dealership Sale?","No"]
[]
[null,null,"Current Vehicle"]
[null,1,"Trade Value",15000,null,19,"RRP or RV*",31000,"*RRP for new cars and KM adjusted Retail Value for used cars."]
[null,2,"Outstanding Loan Balance",12000,null,20,"Amount of Credit",{"$f":"D29","v":30075},"=18"]
[null,3,"Equity",{"$f":"D8-D9","v":3000},"=1-2"]
[null,null,null,null,null,21,"LVR",{"$f":"H9/H8","v":0.97016129032258069},"=20/19"]
[null,null,"Purchase Vehicle",null,null,null,"Note:"]
[null,4,"Sale Price",31000,null,null,"- If LVR > 130%, +150bps will be applied to the interest rate."]
[null,5,"Deposit",1000,null,null,"- LVR > 130% is not available for assets aged 10-12 years at start of term"]
[null,6,"Trade Equity",{"$f":"D10","v":3000},"=3"]
[null,7,"Funds required",{"$f":"D13-D15-D14","v":27000},"=4-6-5"]
[]
[null,null,"Additional costs"]
[null,10,"Insurance",1000]
[null,11,"Warranty",500]
[null,12,"Other Fees",0]
[]
[null,13,"Net Amount Funded",{"$f":"D16+D19+D20+D21","v":28500},"Please insert into cell 'C42' in Serv. Calc"]
[]
[null,14,"LEF",525,"Please insert into cell 'C43' in Serv. Calc"]
[null,15,"Broker Fee",990,"Please insert into cell 'C44' in Serv. Calc"]
[null,16,"PPSR",10]
[null,17,"Private Sale Fee",{"$f":"_xlfn.IFS(E5=\"Yes\",0,E5=\"No\",50)","v":50}]
[null,18,"Amount of Credit",{"$f":"SUM(D23+D25+D26+D27+D28)","v":30075},"=13+14+15+16"]

{"sheet":" Income lookup tables","index":3,"n_rows":342,"n_cols":28,"rows_kept":342,"cut":false,"hidden":true,"merged":[]}
[null,"Income band",0,26000,39000,52000,66000,79000,105000,131000,157000,184000,210000,262000,328000,394000,656000]
[null,null,null,null,null,null,null,null,null,null,null,null,null,null,null,null,null,null,null,null,null,null,null,null,"State",null,"Married status Index"]
[null,null,null,null,null,null,null,null,null,null,null,null,null,null,null,null,null,null,null,null,null,null,null,null,"NSW",null,"Married",2]
[null,null,null,null,null,null,null,null,null,null,null,null,null,null,null,null,null,null,null,null,null,null,null,null,"VIC",null,"Single",1]
[null,null,null,null,null,null,null,null,null,null,null,null,null,null,null,null,null,null,null,null,null,null,null,null,"QLD",null,"Defacto",2]
[null,null,null,null,null,null,null,null,null,null,null,null,null,null,null,null,null,null,null,null,null,null,null,null,"SA"]
[null,null,null,null,null,null,null,null,null,null,null,null,null,null,null,null,null,null,null,null,null,null,null,null,"WA"]
[null,null,null,null,null,null,null,null,null,null,null,null,null,null,null,null,null,null,null,null,null,null,null,null,"TAS"]
[null,null,null,null,null,null,null,null,null,null,null,null,null,null,null,null,null,null,null,null,null,null,null,null,"NT"]
[null,null,null,null,null,null,null,null,null,null,null,null,null,null,null,null,null,null,null,null,null,null,null,null,"ACT"]
["HEM weekly lookup tables"]
["NSWMetro","No of dependents",0,26000,39000,52000,66000,79000,105000,131000,157000,184000,210000,262000,328000,394000,656000]
[2,0,583,583,598,623,664,727,814,888,970,1019,1085,1201,1373,1388,1388,null,null,null,null,null,null,null,"Postcodelookup"]
[2,1,688,688,688,712,753,817,904,979,1061,1110,1176,1293,1466,1481,1481,null,null,null,null,null,null,null,{"$f":"TRIM(IF(OR('Serviceability Calculator'!I37=\"ACT\",'Serviceability Calculator'!I37=\"NT\"),\"ALL\",VLOOKUP('Serviceability Calculator'!$F$38,$Y$36:$Z$86,2)))","v":"NonMetro"}]
[2,2,754,754,754,779,819,882,969,1043,1125,1173,1239,1355,1527,1542,1542]
[2,3,846,846,846,846,886,949,1036,1110,1192,1240,1306,1422,1594,1609,1609]
[2,4,938,938,938,913,954,1016,1103,1177,1259,1308,1373,1490,1661,1676,1676]
[2,5,1030,1030,1030,980,1021,1084,1171,1244,1326,1375,1440,1557,1728,1743,1743]
[2,6,1122,1122,1122,1048,1088,1151,1238,1312,1394,1442,1508,1624,1795,1810,1810]
[2,7,1214,1214,1214,1115,1156,1218,1305,1379,1461,1509,1575,1691,1862,1877,1877]
[2,8,1306,1306,1306,1182,1223,1285,1372,1446,1528,1576,1642,1758,1929,1944,1944]
[2,9,1398,1398,1398,1250,1290,1353,1440,1513,1595,1643,1709,1825,1996,2011,2011]
[2,10,1490,1490,1490,1317,1357,1420,1507,1580,1662,1710,1776,1892,2063,2078,2078]
[1,0,296,311,326,351,392,455,542,616,699,747,813,930,1103,1117,1117]
[1,1,409,409,423,448,488,551,638,712,793,842,907,1023,1195,1209,1209]
[1,2,519,519,533,558,599,661,748,821,903,951,1017,1133,1304,1319,1319]
[1,3,644,644,644,668,709,771,858,931,1013,1061,1126,1242,1413,1428,1428]
[1,4,769,769,754,778,819,881,968,1041,1123,1170,1236,1351,1522,1537,1537]
[1,5,893,893,864,889,929,991,1078,1151,1232,1280,1345,1461,1631,1646,1646]
[1,6,1018,1018,974,999,1039,1101,1187,1261,1342,1390,1455,1570,1740,1755,1755]
[1,7,1143,1143,1085,1109,1149,1211,1297,1370,1452,1499,1564,1679,1849,1864,1864]
[1,8,1268,1268,1195,1219,1259,1321,1407,1480,1561,1609,1674,1789,1959,1973,1973]
[1,9,1393,1393,1305,1329,1369,1431,1517,1590,1671,1719,1784,1898,2068,2082,2082]
[1,10,1518,1518,1415,1440,1480,1541,1627,1700,1781,1828,1893,2008,2177,2191,2191,null,null,null,null,null,null,null,"MetroPostcode"]
[]
["NSWNonMetro","No of dependents",0,26000,39000,52000,66000,79000,105000,131000,157000,184000,210000,262000,328000,394000,656000,null,null,null,null,null,null,null,800,"ALL",null,"Metro  "]
[2,0,611,611,626,651,692,754,842,916,998,1046,1112,1229,1401,1416,1416,null,null,null,null,null,null,null,832,"ALL",null,"NonMetro"]
[2,1,715,715,715,740,781,845,932,1006,1089,1138,1204,1321,1494,1509,1509,null,null,null,null,null,null,null,833,"ALL",null,"All  "]
[2,2,782,782,782,806,847,910,997,1071,1153,1201,1267,1383,1555,1570,1570,null,null,null,null,null,null,null,899,"ALL"]
[2,3,874,874,874,874,914,977,1064,1138,1220,1268,1334,1450,1622,1637,1637,null,null,null,null,null,null,null,2000,"Metro"]
[2,4,966,966,966,941,981,1044,1131,1205,1287,1335,1401,1517,1689,1704,1704,null,null,null,null,null,null,null,2234,"Metro"]
[2,5,1058,1058,1058,1008,1049,1111,1198,1272,1354,1402,1468,1584,1756,1771,1771,null,null,null,null,null,null,null,2235,"NonMetro"]
[2,6,1150,1150,1150,1075,1116,1179,1266,1339,1421,1470,1535,1651,1823,1838,1838,null,null,null,null,null,null,null,2599,"NonMetro"]
[2,7,1242,1242,1242,1143,1183,1246,1333,1407,1489,1537,1602,1719,1890,1905,1905,null,null,null,null,null,null,null,2600,"ALL"]
[2,8,1334,1334,1334,1210,1251,1313,1400,1474,1556,1604,1670,1786,1957,1972,1972,null,null,null,null,null,null,null,2612,"ALL"]
[2,9,1426,1426,1426,1277,1318,1380,1467,1541,1623,1671,1737,1853,2024,2039,2039,null,null,null,null,null,null,null,2613,"NonMetro"]
[2,10,1518,1518,1518,1345,1385,1448,1535,1608,1690,1738,1804,1920,2091,2106,2106,null,null,null,null,null,null,null,2614,"ALL"]
[1,0,324,339,354,379,419,483,570,644,727,775,841,958,1130,1145,1145,null,null,null,null,null,null,null,2617,"ALL"]
[1,1,436,436,451,476,516,579,666,739,821,869,935,1051,1222,1237,1237,null,null,null,null,null,null,null,2618,"NonMetro"]
[1,2,546,546,561,586,626,689,775,849,931,979,1044,1160,1331,1346,1346,null,null,null,null,null,null,null,2899,"NonMetro"]
[1,3,671,671,671,696,736,799,885,959,1040,1088,1154,1270,1441,1455,1455,null,null,null,null,null,null,null,2900,"ALL"]
[1,4,796,796,781,806,846,909,995,1069,1150,1198,1263,1379,1550,1564,1564,null,null,null,null,null,null,null,2906,"ALL"]
[1,5,921,921,892,916,956,1019,1105,1178,1260,1308,1373,1488,1659,1673,1673,null,null,null,null,null,null,null,2907,"NonMetro"]
[1,6,1046,1046,1002,1026,1067,1129,1215,1288,1369,1417,1482,1598,1768,1782,1782,null,null,null,null,null,null,null,2910,"NonMetro"]
[1,7,1171,1171,1112,1137,1177,1239,1325,1398,1479,1527,1592,1707,1877,1892,1892,null,null,null,null,null,null,null,2911,"ALL"]
[1,8,1295,1295,1222,1247,1287,1349,1435,1508,1589,1636,1701,1816,1986,2001,2001,null,null,null,null,null,null,null,2914,"ALL"]
[1,9,1420,1420,1332,1357,1397,1459,1545,1617,1698,1746,1811,1926,2095,2110,2110,null,null,null,null,null,null,null,2915,"NonMetro"]
[1,10,1545,1545,1443,1467,1507,1569,1655,1727,1808,1856,1920,2035,2204,2219,2219,null,null,null,null,null,null,null,2999,"NonMetro"]
[null,null,null,null,null,null,null,null,null,null,null,null,null,null,null,null,null,null,null,null,null,null,null,null,3000,"Metro"]
[null,null,null,null,null,null,null,null,null,null,null,null,null,null,null,null,null,null,null,null,null,null,null,null,3207,"Metro"]
{"$rows_left_out":283}
{"sheet":"Income Tax Rates","index":4,"n_rows":43,"n_cols":10,"rows_kept":43,"cut":false,"hidden":true,"merged":[[7,0,7,2]]}
["Threshold","Amount","Rate",null,"Taxoffset will be avaialbe up to financial year 2021 to 2022"]
[0,0,0,null,"Low income tax offset","Amount",null,null,"Taxable income Applicant1",{"$f":"'Serviceability Calculator'!C23+SUM('Serviceability Calculator'!D23:E23)*0.8+'Serviceability Calculator'!H23*0.8+'Serviceability Calculator'!E25+'Serviceability Calculator'!F23","v":90000}]
[18201,0,0.16,null,0,700]
[45001,4288,0.3,null,37501,{"$f":"IF(AND(J2>=E4,J2<=E5),F3-(J2-E4)*0.05,0)","v":0},null,"between $37,501 and $45,000, you will get $700 minus 5 cents for every $1 above $37,500"]
[135001,31288,0.37,null,45001,{"$f":"IF(AND(J2>=E5,J3<E6),325-(J2-E5)*0.015,0)","v":-349.98500000000001},null,"between $45,001 and $66,667, you will get $325 minus 1.5 cents for every $1 above $45,000"]
[190000,51638,0.45,null,66667,0]
[]
[]
[null,null,null,null,"Low and Middle  income tax offset","Amount"]
["Medicare Surcharge for single",null,null,null,0,0]
["Threshold","Rate",null,null,37000,0]
[0,0,null,null,48000,0]
[90000,0.01,null,null,90000,0]
[105000,1.2500000000000001E-2,null,null,126000,0]
[140000,1.4999999999999999E-2]
[]
[]
[null,null,null,null,"Applicant one"]
[null,null,null,null,"Low income tax offset",{"$f":"VLOOKUP(J2,$E$3:$F$6,2)","v":0}]
["Medicare Surcharge for couple",null,null,null,"Low and Middle income tax offset",{"$f":"VLOOKUP(J2,$E$10:$F$14,2)","v":0}]
["Threshold","Rate"]
[0,0]
[180000,0.01]
[210000,1.2500000000000001E-2]
[280000,1.4999999999999999E-2]
[null,null,null,null,"Low income tax offset","Amount",null,null,"Taxable income Applicant2",{"$f":"'Serviceability Calculator'!C24+SUM('Serviceability Calculator'!D24:E24)*0.8+'Serviceability Calculator'!H24*0.8+'Serviceability Calculator'!F24","v":0}]
[null,null,null,null,0,700]
[null,null,null,null,37501,{"$f":"IF(AND(J26>=E28,J26<=E29),F27-(J26-E28)*0.05,0)","v":0},null,"between $37,501 and $45,000, you will get $700 minus 5 cents for every $1 above $37,500"]
["Threshold for a Discretionary Basics",null,null,null,45001,{"$f":"IF(AND(J26>=E29,J27<E30),325-(J26-E29)*0.015,0)","v":0},null,"between $45,001 and $66,667, you will get $325 minus 1.5 cents for every $1 above $45,000"]
["Pay TV - $20/month = $240 per year",null,null,null,66667,0]
["Child Care - $10/week= $520 per year"]
[]
[null,null,null,null,"Low and Middle  income tax offset","Amount"]
[null,null,null,null,0,0]
[null,null,null,null,37000,0]
[null,null,null,null,48000,0]
[null,null,null,null,90000,0]
[null,null,null,null,126000,0]
[]
[]
[null,null,null,null,"Applicant Two"]
[null,null,null,null,"Low income tax offset",{"$f":"VLOOKUP(J26,E27:F30,2)","v":700}]
[null,null,null,null,"Low and Middle income tax offset",{"$f":"VLOOKUP(J26,E34:F38,2)","v":0}]